Error C3872

Error C3872

  • By :
  • Category : Help
  • Comment : 0

DISMANTLING 08 HILUX DCAB WORKMATE 2TR 5 SPD MAN C3872 001

RECOMMENDED: If you have Windows errors then we strongly recommend that you download and run this (Windows) Repair Tool.

Unicode character check – C++ Forum – Cplusplus.com – line 1 error C3872: '0x2028': this character is not allowed in an identifier. The error looks like it is saying there is a Unicode line separator up.

The compiler does not allow a universal character name (UCN) if the hex value is less than 0x20 or in the. int \u0040; // C3872 }

This site uses cookies for analytics, personalized content and ads. By continuing to browse this site, you agree to this use. Learn more

Error Lnk2001 Unresolved External Symbol _memset What is an undefined reference/unresolved external symbol error and how do I fix it? 27 answers. error LNK2001: unresolved external symbol, due to ifstream object. 0. Common compilation problems – Second Life Wiki – 4.3.14 memset used with constant zero length parameter; 4.3.15 Boost errors in. llcompilequeue.obj : error LNK2019: unresolved external symbol "int __cdecl.

Camera Integration. Through rigorous testing of cameras, availability of specific and generic drivers, 3VR enables seamless integration and greater interoperability.

Error Message; Compiler Error C3500: invalid ProgID ‘progid’ Compiler Error C3501: there is no typelib registered for ProgID ‘progid’ Compiler Error C3502

2011年10月20日. 中文解释error C3872: “0x3000”: 此字符不允许在标识符中使用这主要出现在从文档 中拷贝程序代码时,由于含有了中文字符空格而造成的。

Error Unrecognized Command Line Option – Fno-stack-protector Apache Reverse Proxy Error 503 Hi, I am a newbie to reverse proxy (and system administration in general) and I am looking for pointers. I have an operational Apache 2.2 server accepting I'm a newbie with nginx and I got a headeach with the server configuration. I configured Nginx as reverse proxy for Apache, all

Problem compile new c++ unreal project UE 4.12 error C3872 '0xac. – Hello guys, i am trying to create a new project with unreal engine but i get this errors: error C3872 '0xac' and fatal error C1021 like in the picture.

Compiler Errors C3500 through C3999 Compiler Error C3867. Compiler Error C3867. Compiler Error C3867. Compiler Error C3872. Compiler Error C3873. Compiler Error.

Jan 2, 2014. error C2143: syntax error : missing ';' before '|' 1>c:program files (x86)microsoft visual studio 12.0vcincludexmemory0(2): error C3872:.

Error C3872 when debug with opengl – social.msdn.microsoft.com – Error C3872 when debug with opengl. Visual Studio Development > Visual Studio Diagnostics (Debugger, Profiler, IntelliTrace) Visual Studio Diagnostics.

2015年8月25日. error C3872: '0xa0': this character is not allowed in an identifier 这个意思就是说 出现中文切换问题。 这是因为直接复制代码的问题。0xa0是十六进.

Compiler Errors C3500 through C3999 Compiler Error C3872. Compiler Error C3872. Compiler Error C3872. Compiler Error C3500 · Compiler Error C3501.

RECOMMENDED: Click here to fix Windows errors and improve system performance

ep48evxgsy